avviso relativo A bando
type: ObjectProperty
type: FunctionalProperty
comment: Relazione che collega la classe avviso pubblico regionale con la classe Bando ISI
comment: This object property links the Regional official announcement class with the Bando ISI funding program class @en
range: BandoISI
domain: AvvisoPubblicoRegionale
label: notifies BANDO ISI funding program @en