funding program Appendix budget
type: DatatypeProperty
comment: Budget available for each Appendix of the BANDO ISI funding program.
comment: Budget a disposizione per ogni Asse di finanziamento. @it
domain: AssePrevenzione
label: budget asse di prevenzione @it