funding program Appendix code
type: DatatypeProperty
comment: Identification code of the chosen Appendix available in the Bando ISI funding program.
comment: Codice identificativo dell'Asse di finanziamento. @it
domain: AssePrevenzione
label: codice asse prevenzione @it