GRU code
type: DatatypeProperty
comment: The GRU code is assigned to each application form. It's a unique code that is used to track and manage online application by the INAIL institute.
comment: Il codice GRU è generato automaticamente al momento della presentazione della domanda. Si riferisce a un identificativo univico assegnato a ciascuna domanda presentata dai partecipanti. GRU è l'acronimo di Gestione Richieste Utenti, e questo codice è usato principalmente per tracciare e gestire le pratiche nel sistema informatico INAIL. @it
domain: PresentatoreDomandaProgettoPrevenzione
label: codice GRU @it