data invio perizia progetto prevenzione
type: DatatypeProperty
comment: Data di invio della perizia relativa al progetto di prevenzione.
comment: The day when the technical inspection is carried out @en
domain: PeriziaProgettoPrevenzione
label: risk management survey submission date @en
type: FunctionalProperty