Bando ISI portal publish date
type: DatatypeProperty
comment: The date on which a Bando ISI date is realesed on the Bando ISI portal.
comment: Data pubblicazione portale Bando ISI @it
domain: BandoISI
label: data pubblicazione portale Bando ISI @it
range: dateTime