descrizione progetto prevenzione
type: DatatypeProperty
comment: Descrizione del progetto di prevenzione e delle sue finalità.
comment: Purpose and description of a risk management plan @en
domain: ProgettoPrevenzione
label: Risk management plan description @en