has reference Bando ISI appendix
type: ObjectProperty
type: FunctionalProperty
comment: There are as many Bando ISI lists as there are Bando ISI appendices
comment: Relazione che collega l'asse bando ISI all'elenco cronologico e viceversa @it
domain: ElencoCronologicoBandoISI
label: elenco rispetto ad asse @it
range: AssePrevenzione