ha Elenco Cronologico Definitivo
type: ObjectProperty
comment: Relazione che collega la classe elenchi cronologici click day e la classe elenchi NCD alla classe elenchi cronologici Bandi ISI definitivi
domain: ElencoCronologicoBandoISI
label: has official ranking list @en
range: ElencoCronologicoBandoISIDefinitivo