ha Elenco Cronologico Provvisorio
type: ObjectProperty
comment: Relazione che collega le classi Elenchi Click Day e Elenchi NCD con la classe Elenchi Cronologici Bandi ISI Provvisori
range: ElencoCronologicoBandoISIProvvisorio
domain: ElencoCronologicoBandoISI
label: has temporary ranking list @en