id asse prevenzione
type: DatatypeProperty
type: FunctionalProperty
comment: Identificativo univoco dell'Asse di finanziamento.
comment: Funding program Appendix unique identifier. @en
domain: AssePrevenzione
label: funding program Appendix ID @en