id progetto prevenzione
type: DatatypeProperty
comment: Identificativo univoco del progetto di prevenzione.
comment: Unique Identifier of a risk management plan @en
domain: ProgettoPrevenzione
label: risk managment plan ID @en
type: FunctionalProperty