risk management plan deposit amount
type: DatatypeProperty
comment: Risk management plan deposit amount
comment: Importo anticipo progetto prevenzione. @it
domain: ProgettoPrevenzione
label: importo anticipo progetto prevenzione @it