risk management plan verified amount
type: DatatypeProperty
comment: Risk management plan certification fee
comment: Importo certificazione progetto prevenzione. @it
domain: ProgettoPrevenzione
label: importo certificazione progetto prevenzione @it