risk management plan consulting session fee
type: DatatypeProperty
comment: Risk management plan consulting session fee
comment: Importo consulenza progetto prevenzione. @it
domain: ProgettoPrevenzione
label: importo consulenza progetto prevenzione @it