importo impiegato avviso pubblico regionale
type: DatatypeProperty
comment: Importo impiegato avviso pubblico regionale.
domain: AvvisoPubblicoRegionale
label: regional official announcement expense amount @en