risk management plan maximum grant amount
type: DatatypeProperty
comment: Maximum grant amount that can be granted during a risk management plan application process
comment: importo massimo finanziato progetto prevenzione. @it
domain: ProgettoPrevenzione
label: importo massimo finanziato progetto prevenzione @it