importo previsionale vendita O permuta progetto prevenzione
type: DatatypeProperty
comment: Importo previsionale vendita o permuta progetto prevenzione.
comment: Risk management plan cost forecasting or exchange @en
domain: ProgettoPrevenzione
label: risk management plan cost forecasting or exchange @en