importo progetto richiesto pratica progetto prevenzione
type: DatatypeProperty
comment: importo progetto richiesto pratica progetto prevenzione
comment: Bando ISI application record requested amount @en
domain: PraticaProgettoPrevenzione
label: Bando ISI application record requested amount @en