importo progetto richiesto stato passato pratica progetto prevenzione
type: DatatypeProperty
comment: Importo progetto richiesto stato passato pratica progetto prevenzione.
comment: Archived Bando ISI application funding request amount @en
domain: StatoPassatoPraticaProgettoPrevenzione
label: archived Bando ISI application funding request amount @en