risk management plan funding request
type: DatatypeProperty
comment: The amount of funding requested at the time of the application
comment: Importo del finanziamento richiesto per il progetto di prevenzione. @it
domain: ProgettoPrevenzione
label: importo richiesto progetto prevenzione @it