indirizzo PEC presentatore domanda prevenzione
type: DatatypeProperty
comment: Indirizzo PEC del soggetto che presenta la domanda di partecipazione al bando ISI.
comment: The PEC address (certified email address) of the person who is in charge of submitting the Bando ISI application. @en
domain: PresentatoreDomandaProgettoPrevenzione
label: bando ISI applicant PEC address