modello perizia
type: DatatypeProperty
comment: Modello di perizia fornito dall'INAIL che deve essere compilato relativamente al progetto di prevenzione.
comment: INAIL Bando Isi risk management survey forms that have to be filled out and sent together with the application form. @en
domain: PeriziaProgettoPrevenzione
label: bando Isi survey form @en
type: FunctionalProperty