pratica progetto prevenzione ha stato passato
type: ObjectProperty
comment: Relazione che collega la classe Pratica Progetto Prevenzione alla classe Stato Pratica Progetto Prevenzione.
comment: This object property links together the Bando ISI application dossier class to the Bando ISI archive class. @en
range: StatoPassatoPraticaProgettoPrevenzione
domain: PraticaProgettoPrevenzione
label: has Bando ISI archive @en