needs verification
type: ObjectProperty
comment: This object property links together the Bando ISI application dossier class to the Bando ISI examination checklist class.
comment: Relazione che collega la pratica progetto prevenzione alla classe Verifica Pratica Progetto Prevenzione @it
domain: PraticaProgettoPrevenzione
label: pratica progetto prevenzione verificata da @it
range: VerificaPraticaProgettoPrevenzione