risk management program has survey
type: ObjectProperty
comment: This object property links together the Risk management plan class with the Risk Management Plan Suvery class.
comment: Relazione che collega un progetto prevenzione alla classa Perizia Progetto Prevenzione. Un progetto prevenzione può avere più di una perizia associata. @it
range: PeriziaProgettoPrevenzione
domain: ProgettoPrevenzione
label: progetto prevenzione associato a perizia @it