punteggio totale progetto prevenzione
type: DatatypeProperty
comment: Punteggio totale ottenuto per il progetto di prevenzione utile per il superamento del punteggio soglia e del conseguente accesso alla graduatoria del bando.
comment: Final score obtained on your risk management plan application, which is crucial to understand eligibility requirements. Those who have reached the minium credit requirements would be potentially eligible for grant approval. @en
domain: ProgettoPrevenzione
label: risk management plan final score @en