stato pratica progetto prevenzione
type: DatatypeProperty
comment: Stato pratica progetto prevenzione.
comment: Bando ISI application record status. @en
domain: PraticaProgettoPrevenzione
label: bando ISI application record status @en