stato pratica stato passato pratica progetto prevenzione
type: DatatypeProperty
comment: Stato pratica stato passato pratica progetto prevenzione
comment: Archived Bando ISI application status. @en
domain: StatoPassatoPraticaProgettoPrevenzione
label: archived Bando ISI application status @en